carnisme
type: Concept
type: NamedIndividual
broader: C1069
definition: Attitude intellectuelle, morale et sociétale qui justifie la consommation de viande par les humains. Les végans et leurs portes paroles les plus engagés considèrent que le carnisme est une idéologie dominante et invisible qui pousse l'homme à manger de la chair animale alors que ce n'est ni nécessaire ni justifié.
in scheme: ThesaurusViande

RDF description of C595
primary topic: carnisme