RDF description of C600
primary topic: menu

menu
type: Concept
type: NamedIndividual
broader: C1154
definition: Boyau naturel comestible issu du traitement de l’intestin grêle des bovins, ovins, porcins, équidés.
in scheme: ThesaurusViande
narrower: C1178
narrower: C122
narrower: C1042
narrower: C567