chair
type: Concept
type: NamedIndividual
broader: C580
definition: Partie molle du corps des animaux (et des hommes). La chair des animaux terrestres et marins est considérée comme un aliment.
in scheme: ThesaurusViande

RDF description of C709
primary topic: chair