RDF description of C712
primary topic: T-bone de cheval

T-bone de cheval
type: Concept
type: NamedIndividual
broader: C387
definition: Tranche épaisse du cheval correspondant au filet et au contre-filet avec l’os. Il se consomme grillé au barbecue ou poêlé.
in scheme: ThesaurusViande