RDF description of C714
primary topic: mixed-gril

mixed-gril
type: Concept
type: NamedIndividual
broader: C1471
definition: Préparation culinaire d’origine anglo-saxonne. Cette recette consiste en un assortiment de différentes viandes grillées et accompagnées de légumes, de salades et de sauces diverses. Les viandes choisies peuvent être des côtelettes d’agneau, des côtes de veau, des blancs de poulet, des chipolatas, des rognons d’agneau ou de veau, des côtes de porc, du magret de canard ; elles peuvent être marinées et enrobées d’herbes fines.
in scheme: ThesaurusViande