RDF description of C734
primary topic: taureau

taureau
type: Concept
type: NamedIndividual
broader: C1187
definition: Bovin mâle non castré, utilisé comme reproducteur. Pour la boucherie, la catégorie taureau comprend les bovins mâles âgés de plus de 24 mois. Il s’agit essentiellement des taureaux de réforme, après leur carrière de reproducteur.
in scheme: ThesaurusViande
related: C708