RDF description of C749
primary topic: chanfrein

chanfrein
type: Concept
type: NamedIndividual
broader: C82
definition: Partie de la tête des bovins et équins allant du front au mufle formant la voûte des fosses nasales.
in scheme: ThesaurusViande