besson
type: Concept
type: NamedIndividual
broader: C488
definition: Dérivé du latin bis ou bissus, ce terme désigne des agneaux jumeaux.
in scheme: ThesaurusViande
related: C488

RDF description of C786
primary topic: besson