RDF description of C82
primary topic: zootechnie

zootechnie
type: Concept
type: NamedIndividual
definition: Ensemble des techniques et des sciences relatives à l’élevage et aux productions animales en vue d’obtenir des produits (lait, viande, œufs, cuir, laine) ou des services (traction, loisirs, sports) utilisés par l’homme. La zootechnie englobe de nombreuses sciences du vivant : la génétique, la physiologie, l’éthologie, l’épidémiologie et l’hygiène, ainsi que la médecine vétérinaire et l’économie des productions animales. L’Association Française de Zootechnie (AFZ) a été créé en 1949 par le très célèbre professeur A-M Leroy, l’un des pères de la zootechnie française moderne. Elle regroupe aujourd’hui 45 organismes et près de 200 spécialistes.
in scheme: ThesaurusViande
narrower: C1291
narrower: C437
narrower: C962
narrower: C883
narrower: C273
narrower: C908
narrower: C594
narrower: C817
narrower: C1010
narrower: C398
narrower: C653
narrower: C116
narrower: C544
narrower: C556
narrower: C985
narrower: C1181
narrower: C7
narrower: C808
narrower: C1013
narrower: C1156
narrower: C264
narrower: C1354
narrower: C399
narrower: C1055
narrower: C749
narrower: C610
narrower: C400
narrower: C1174
narrower: C1150
top concept of: ThesaurusViande