RDF description of C845
primary topic: cotis

cotis
type: Concept
type: NamedIndividual
broader: C1086
definition: Travers de porc. Une des stars du barbecue. Laqués, c’est un plat phare de la cuisine chinoise.
in scheme: ThesaurusViande