RDF description of C847
primary topic: restrainer

restrainer
type: Concept
type: NamedIndividual
broader: C83
definition: Tapis mécanique en forme de « V » pour la contention et l’amenée automatique des animaux au poste d’étourdissement.
in scheme: ThesaurusViande