RDF description of C858
primary topic: foie gras

foie gras
type: Concept
type: NamedIndividual
broader: C1454
definition: D’oie ou de canard, le foie gras, obtenu après une période de gavage de plusieurs semaines, est hypertrophié par d’importantes infiltrations de gras. Très apprécié dans la gastronomie française (et autres…), le foie gras se prête à toutes les formes de préparation, cru ou cuit, frais ou en conserve. Dans le tournedos Rossini, le foie gras est associé à la viande rouge pour le plus grand plaisir des gourmets.
in scheme: ThesaurusViande
related: C505
related: C904