RDF description of C877
primary topic: standard

standard
type: Concept
type: NamedIndividual
broader: C853
definition: Ensemble des caractères et qualités définissant une race.
in scheme: ThesaurusViande
narrower: C1108
narrower: C1231