bétaillère
type: Concept
type: NamedIndividual
broader: C1051
definition: Véhicule aménagé et utilisé pour le transport du bétail : camion bétaillère couramment appelée bétaillère, bateau bétaillère, wagon bétaillère.
in scheme: ThesaurusViande
related: C1051

RDF description of C896
primary topic: bétaillère