longe de porc
type: Concept
type: NamedIndividual
broader: C163
definition: Découpe en gros du porc. Occupant la région dorsale, lombaire et ilio sacrée, la longe a pour base osseuse les vertèbres thoraciques, lombaires, l’ilium et le sacrum. Elle représente de 30 à 35% du poids de la carcasse. Elle se compose de l’échine, du carré, du filet, de la pointe et du travers. La longe peut être présentée de multiples façons : avec ou sans palette, avec ou sans travers, avec ou sans pointe et échine. La longe est consommée fraîche, en côtelettes et rôtis. Après fabrication, on obtient aussi des carrés fumés, des coppas, du bacon, du kassler.
in scheme: ThesaurusViande
narrower: C1465
narrower: C333
narrower: C321
narrower: C1086
narrower: C356
narrower: C932
narrower: C1083
narrower: C933
related: C887
related: C333
related: C321
related: C1086
related: C356
related: C933
related: C1083

RDF description of C952
primary topic: longe de porc