cochette
type: Concept
type: NamedIndividual
broader: C1013
definition: Jeune truie élevée pour le renouvellement du troupeau. Après la première mise-bas, la cochette devient une truie.
in scheme: ThesaurusViande
related: C195
related: C1099

RDF description of C975
primary topic: cochette