boute en train
type: Concept
type: NamedIndividual
broader: C1013
definition: Mâle castré ou femelle utilisé comme leurre pour détecter les femelles en chaleur ou pour stimuler les taureaux pour la collecte du sperme
in scheme: ThesaurusViande

RDF description of C981
primary topic: boute en train