Annotation of Agricultural Text
type: Ontology
version IRI: https://opendata.inrae.fr/2at-def/1
imports: https://opendata.inrae.fr/tap-def/1
abstract: Annotation de Texte Agricole (2ATO) stocke les résultats des processus de traitements du domaine agricole et décrit l'ensemble des informations de provenance. @fr
abstract: Annotation of Agricultural Text (2ATO) stores the results of NLP workflow processes dedicated to agricultural texts and describes all the provenance information.
contributor: https://orcid.org/0000-0001-6652-9319
contributor: https://orcid.org/0000-0001-9694-1443
contributor: https://orcid.org/0000-0003-2487-1743
contributor: https://orcid.org/0000-0003-4189-4322
contributor: François-Xavier SENNESAL, Dipso, INRAE (https://orcid.org/0000-0003-2487-1743)
contributor: Marine COURTIN, MAIAGE, INRAE (https://orcid.org/0000-0003-4189-4322)
contributor: Robert BOSSY, MAIAGE INRAE Center Jouy-en-Josas Antony (https://orcid.org/0000-0001-6652-9319)
contributor: Stephan BERNARD, LISC, INRAE (https://orcid.org/0000-0001-9694-1443)
created: 2025-02-05T00:00:00+01:00
creator: https://orcid.org/0000-0002-3076-5499
creator: Catherine ROUSSEY, MISTEA, INRAE (https://orcid.org/0000-0002-3076-5499)
description: Annotation de Texte Agricole (2ATO) stocke les résultats des processus de traitements de la langue du domaine agricole et décrit l'ensemble des informations de provenance. 2ATO est une spécialisation de TAPO adaptée aux bulletins de santé du végétal et aux avertissements agricoles. Cette ontologie a été construite dans le cadre du projet D2KAB. @fr
description: Annotation of Agricultural Text (2ATO) stores the results of NLP workflow processes dedicated to agricultural texts and describes all the provenance information. 2ATO is an specialization of TAPO adapted for French agricultural alert bulletins called that are "Bulletin de Santé du Végétal" (Plant Health Bulletin) and "les Avertissements Agricoles" (Agricultural warnings). This ontology was build during the D2KAB project.
issued: 2025-02-05T00:00:00+01:00
license: http://creativecommons.org/licenses/by-nc/4.0/
publisher: Mathématiques et Informatique Appliquées du Génome à l'Environnement (MAIAGE) [http://maiage.jouy.inra.fr], ror: [https://ror.org/05qdnns64]
publisher: Mathématiques, Informatique et Statistique pour l'Environnement et l'Agronomie (MISTEA) [https://www6.montpellier.inra.fr/mistea_eng/], ror: [https://ror.org/01pd2sz18]
publisher: National research institute for agriculture food and environment (INRAE) [https://www.inrae.fr/], ror:[https://ror.org/003vg9w96]
title: Annotation de Texte Agricole @fr
preferred namespace prefix: 2ato
preferred namespace uri: https://opendata.inrae.fr/2at-def#
version info: 1.0
funding: ANR-18-CE23-0017 D2KAB (Data to Knowledge in Agronomy and Biodiversity) http://www.d2kab.org . WP T4.3 BSV Reader

has body
type: ObjectProperty
definition: A relationship between an oa:Annotation and its body (the entity extracted). This object property is a copy of the annotation property oa:hasBody that is visible used by reasonner.

has target
type: ObjectProperty
definition: The relationship between an Annotation and its Target (part of the document that contains an entity's label). This object property is a copy of the annotation property oa:hasTarget, that is visible by reasonner.

Annotation of Aggression Nary Relation
type: Class
equivalent class: Class
  intersection of: Annotation
  intersection of: Restriction
    on property: has body
    some values from: Aggression
subclass of: NaryRelationAnnotation
definition: La classe des annotations dont le corps est un noeud RDF qui représente une relation n-aire d’agression (instance de la classe Aggression). @fr
definition: the class of annotations whose body is a RDF node that represents the n-ary relation of aggression (instance of Aggression class).
preferred label: Annotation de Relation Naire d’Agression @fr

Annotation of Binary Relation Attack
type: Class
subclass of: BinaryRelationAnnotation
definition: La classe des annotations dont le corps est un triplet RDF avec la propriété bago:attack ou bago:isAttackedBy. La propriété crée un lien entre un organisme nuisible et un organisme hôte. @fr
definition: the class of annotations whose body is a RDF triplet with object property bago:attack or bago:isAttackedBy. The property creates a link between an harmfull organism and an host organism.
preferred label: Annotation de Relation Binaire Attaque @fr

Automatic Annotation of Binary Relation Attack
type: Class
subclass of: Annotation of Binary Relation Attack
subclass of: AutomaticBinaryRelationAnnotation
definition: La classe des annotations automatiques dont le corps est un triplet RDF avec la propriété bago:attack ou bago:isAttackedBy. La propriété crée un lien entre un organisme nuisible et un organisme hôte. @fr
definition: the class of automatic annotations whose body is a RDF triplet with object property bago:attack or bago:isAttackedBy. The property creates a link between an harmfull organism and an host organism.
preferred label: Annotation Automatique des Relations Binaires Attaque @fr

Manual Annotation of Binary Relation Attack
type: Class
subclass of: Annotation of Binary Relation Attack
subclass of: ManualBinaryRelationAnnotation
definition: La classe des annotations manuelles dont le corps est un triplet RDF avec la propriété bago:attack ou bago:isAttackedBy. La propriété crée un lien entre un organisme nuisible et un organisme hôte. @fr
definition: the class of manual annotations whose body is a RDF triplet with object property bago:attack or bago:isAttackedBy. The property creates a link between an harmfull organism and an host organism.
preferred label: Annotation Manuelle des Relations Binaires Attaque @fr

Attack Statement
type: Class
subclass of: Statement
definition: la classe des déclarations rdf (rdf:Statement) dont le prédicat est bago:attack @fr
definition: the class of rdf:Statement whose rdf:predicate is bago:attack
preferred label: Déclaration d’Attaque @fr

Automatic Annotation of Annotation of Aggression Nary Relation Relation
type: Class
subclass of: Annotation of Aggression Nary Relation
subclass of: AutomaticNaryRelationAnnotation
definition: La classe des annotations automatiques dont le corps est un noeud RDF qui représente une relation n-aire d’agression (instance de la classe Aggression). @fr
definition: the class of automatic annotations whose body is a RDF RDF node that represents the n-ary relation of aggression (instance of Aggression class).
preferred label: Annotation Automatique de Relation Naire d’Agression @fr

Automatic Annotation of Causal Binary Relation
type: Class
subclass of: Annotation of Causal Binary Relation
subclass of: AutomaticBinaryRelationAnnotation
definition: La classe des annotations automatiques dont le corps est un triplet RDF avec la propriété bago:cause ou bago:isCausedBy. La propriété crée un lien entre un organisme nuisible et une maladie. @fr
definition: the class of automatic annotations whose body is a RDF triplet with object property bago:cause or bago:isCausedBy. The property creates a link between an harmfull organism and a disease.
preferred label: Annotation Automatique de Relation Binaire Causale @fr

Automatic Annotation of Crops
type: Class
subclass of: Annotation of Crops
subclass of: AutomaticEntityAnnotation
definition: La classe des annotations automatiques dont le corps est une ou plusieurs plantes cultivées. @fr
definition: the class of automatic annotations whose body is one or many crops.
preferred label: Annotation Automatiques des Plantes Cultivées @fr

Automatic Annotation of Cultivars
type: Class
subclass of: Annotation of Cultivars
subclass of: AutomaticEntityAnnotation
definition: La classe des annotations automatiques dont le corps est une ou plusieurs variétés de plante cultivée. @fr
definition: La classe des annotations automatiques dont le corps est une ou plusieurs variétés. @fr
definition: the class of automatic annotations whose body is one or many cultivar
definition: the class of automatic annotations whose body is one or many cultivars.
preferred label: Annotation Automatique des Variétés @fr
preferred label: Annotation Automatiques des Variétés @fr

Automatic Annotation of Development Stages
type: Class
subclass of: Annotation of Development Stages
subclass of: AutomaticEntityAnnotation
definition: La classe des annotations automatiques dont le corps est un ou plusieurs stades de développement. @fr
definition: the class of automatic annotations whose body is one or many development stages.
preferred label: Annotation Automatique des Stades de Développement @fr

Automatic Annotation of Diseases
type: Class
subclass of: Automatic of Diseases
subclass of: AutomaticEntityAnnotation
definition: La classe des annotations automatiques dont le corps est une ou plusieurs maladies. @fr
definition: the class of automatic annotations whose body is one or many diseases
preferred label: Annotation Automatique des Maladies @fr

Automatic Annotation of Harbor Binary Relation
type: Class
subclass of: Annotation of Harbor Binary Relation
subclass of: AutomaticBinaryRelationAnnotation
definition: La classe des annotations automatiques dont le corps est un triplet RDF avec la propriété bago:harbor ou bago:isFoundOn. La propriété crée un lien entre un organisme hôte et un vecteur. @fr
definition: the class of automatic annotations whose body is a RDF triplet with object property bago:harbor or bago:isFoundOn. The property creates a link between a host organism and a vector.
preferred label: Annotation Automatique de Relation Binaire Accueillir @fr

Automatic Annotation of Harmful Organisms
type: Class
subclass of: Annotation of Harmful Organisms
subclass of: AutomaticEntityAnnotation
definition: La classe des annotations automatiques dont le corps est un ou plusieurs organismes nuisibles. @fr
definition: the class of automatic annotations whose body is one or many harmful organism
preferred label: Annotation Automatique des Organismes Nuisibles @fr

Automatic Annotation of Pathogens
type: Class
subclass of: Annotation of Pathogens
subclass of: AutomaticEntityAnnotation
definition: La classe des annotations automatiques dont le corps est un ou plusieurs pathogènes. @fr
definition: the class of automatic annotations whose body is one or many pathogens
preferred label: Annotation Automatique des Pathogènes @fr

Automatic Annotation of Pests
type: Class
subclass of: Annotation of Pests
subclass of: AutomaticEntityAnnotation
definition: La classe des annotations automatiques dont le corps est un ou plusieurs ravageurs. @fr
definition: the class of automatic annotations whose body is one or many pest
preferred label: Annotation Automatique des Ravageurs @fr

Automatic Annotation of Spread Binary Relation
type: Class
subclass of: Annotation of Spread Binary Relation
subclass of: AutomaticBinaryRelationAnnotation
definition: La classe des annotations automatiques dont le corps est un triplet RDF avec la propriété bago:isSpreadBy ou bago:transmitTheCauseOf. La propriété crée un lien entre une maladie et un vecteur. @fr
definition: the class of automatic annotations whose body is a RDF triplet with object property bago:isSpreadBy or bago:transmitTheCauseOf. The property creates a link between a disease and a vector.
preferred label: Annotation Automatique de Relation Binaire de Dissémination @fr

Automatic Annotation of Stage Binary Relation
type: Class
subclass of: AutomaticBinaryRelationAnnotation
subclass of: SpatialBinaryRelationAnnotation
definition: La classe des annotations automatiques dont le corps est un triplet RDF avec la propriété bago:hasStage. La propriété crée un lien entre un organisme et son stade de développement. @fr
definition: the class of automatic annotations whose body is a RDF triplet with object property bago:hasStage. The property links an organism to its development stage.
preferred label: Annotation Automatique de Relation Binaire Stade @fr

Automatic Annotation of Transport Binary Relation
type: Class
subclass of: Annotation of Transport Binary Relation
subclass of: AutomaticBinaryRelationAnnotation
definition: La classe des annotations automatiques dont le corps est un triplet RDF avec la propriété bago:transport ou bago:isTransportedBy. La propriété crée un lien entre un organisme nuisible et un vecteur. @fr
definition: the class of automatic annotations whose body is a RDF triplet with object property bago:transport or bago:isTransportedBy. The property creates a link between an harmfull organism and a vector.
preferred label: Annotation Automatique de Relation Binaire de Transport @fr

Automatic Annotation of Vectors
type: Class
subclass of: Annotation of Vectors
subclass of: AutomaticEntityAnnotation
definition: La classe des annotations automatiques dont le corps est un ou plusieurs vecteurs de maladie. @fr
definition: the class of automatic annotations whose body is one or many vectors
preferred label: Annotation Automatique des Vecteurs @fr

Causal Statement
type: Class
subclass of: Statement
definition: la classe des déclarations rdf (rdf:Statement) dont le prédicat est bago:cause @fr
definition: the class of rdf:Statement whose rdf:predicate is bago:cause
preferred label: Déclaration de Causalité @fr

Annotation of Causal Binary Relation
type: Class
subclass of: BinaryRelationAnnotation
definition: La classe des annotations dont le corps est un triplet RDF avec la propriété bago:cause ou bago:isCausedBy. La propriété crée un lien entre un organisme nuisible et une maladie. @fr
definition: the class of annotations whose body is a RDF triplet with object property bago:cause or bago:isCausedBy. The property creates a link between an harmfull organism and a disease.
preferred label: Annotation de Relation Binaire Causale @fr

Annotation of Crops
type: Class
equivalent class: Class
  intersection of: EntityAnnotation
  intersection of: Restriction
    on property: has body
    some values from: Crop
subclass of: EntityAnnotation
definition: La classe des annotations dont le corps est une ou plusieurs plantes cultivées. @fr
definition: the class of annotations whose body is one or many crops.
preferred label: Annotation des Plantes Cultivées @fr

Cultivar
type: Class
subclass of: Thing
definition: La classe des variétés de plantes cultivées @fr
definition: The class of cultivars
preferred label: Variété @fr

Annotation of Cultivars
type: Class
equivalent class: Class
  intersection of: EntityAnnotation
  intersection of: Restriction
    on property: has body
    some values from: Cultivar
subclass of: EntityAnnotation
definition: La classe des annotations dont le corps est une ou plusieurs variétés de plante cultivée. @fr
definition: La classe des annotations dont le corps est une ou plusieurs variétés. @fr
definition: the class of annotations whose body is one or many cultivar
definition: the class of annotations whose body is one or many cultivars.
preferred label: Annotation des Variétés @fr

Annotation of Development Stages
type: Class
equivalent class: Class
  intersection of: EntityAnnotation
  intersection of: Restriction
    on property: has body
    some values from: GrowthStage
subclass of: EntityAnnotation
definition: La classe des annotations dont le corps est un ou plusieurs stades de développement. @fr
definition: the class of annotations whose body is one or many development stages.
preferred label: Annotation des Stades de Développement @fr

Automatic of Diseases
type: Class
equivalent class: Class
  intersection of: EntityAnnotation
  intersection of: Restriction
    on property: has body
    some values from: Disease
subclass of: EntityAnnotation
definition: La classe des annotations dont le corps est une ou plusieurs maladies. @fr
definition: the class of annotations whose body is one or many diseases
preferred label: Annotation des Maladies @fr

Growth Statement
type: Class
subclass of: Statement
definition: la classe des déclarations rdf (rdf:Statement) dont le prédicat est bago:hasStage @fr
definition: the class of rdf:Statement whose rdf:predicate is bago:hasStage
preferred label: Déclaration de Développement @fr

Annotation of Harbor Binary Relation
type: Class
subclass of: BinaryRelationAnnotation
definition: La classe des annotations dont le corps est un triplet RDF avec la propriété bago:harbor ou bago:isFoundOn. La propriété crée un lien entre un organisme hôte et un vecteur. @fr
definition: the class of annotations whose body is a RDF triplet with object property bago:harbor or bago:isFoundOn. The property creates a link between a host organism and a vector.
preferred label: Annotation de Relation Binaire Accueillir @fr

Harbor Statement
type: Class
subclass of: Statement
definition: la classe des déclarations rdf (rdf:Statement) dont le prédicat est bago:harbor @fr
definition: the class of rdf:Statement whose rdf:predicate is bago:harbor
preferred label: Déclaration d’Accueil @fr

Annotation of Harmful Organisms
type: Class
equivalent class: Class
  intersection of: EntityAnnotation
  intersection of: Restriction
    on property: has body
    some values from: HarmfulOrganism
subclass of: EntityAnnotation
definition: La classe des annotations dont le corps est un ou plusieurs organismes nuisibles. @fr
definition: the class of annotations whose body is one or many harmful organism
preferred label: Annotation des Organismes Nuisibles @fr

Manual Annotation of Annotation of Aggression Nary Relation Relation
type: Class
subclass of: Annotation of Aggression Nary Relation
subclass of: ManualNaryRelationAnnotation
definition: La classe des annotations manuelles dont le corps est un noeud RDF qui représente une relation n-aire d’agression (instance de la classe Aggression). @fr
definition: the class of manual annotations whose body is a RDF RDF node that represents the n-ary relation of aggression (instance of Aggression class).
preferred label: Annotation Manuelle de Relation Binaire Naire d’Agression @fr

Manual Annotation of Causal Binary Relation
type: Class
subclass of: Annotation of Causal Binary Relation
subclass of: ManualBinaryRelationAnnotation
definition: La classe des annotations manuelles dont le corps est un triplet RDF avec la propriété bago:cause ou bago:isCausedBy. La propriété crée un lien entre un organisme nuisible et une maladie. @fr
definition: the class of manual annotations whose body is a RDF triplet with object property bago:cause or bago:isCausedBy. The property creates a link between an harmfull organism and a disease.
preferred label: Annotation Manuelle de Relation Binaire Causale @fr

Manual Annotation of Crops
type: Class
subclass of: Annotation of Crops
subclass of: ManualEntityAnnotation
definition: La classe des annotations manuelles dont le corps est une ou plusieurs plantes cultivées. @fr
definition: the class of manual annotations whose body is one or many crops.
preferred label: Annotation Manuelle des Plantes Cultivées @fr

Manual Annotation of Cultivars
type: Class
subclass of: Annotation of Cultivars
subclass of: ManualEntityAnnotation
definition: La classe des annotations manuelles dont le corps est une ou plusieurs variétés de plante cultivée. @fr
definition: La classe des annotations manuelles dont le corps est une ou plusieurs variétés. @fr
definition: the class of manual annotations whose body is one or many cultivar
definition: the class of manual annotations whose body is one or many cultivars.
preferred label: Annotation Manuelle des Variétés @fr

Manual Annotation of Development Stages
type: Class
subclass of: Annotation of Development Stages
subclass of: ManualEntityAnnotation
definition: La classe des annotations manuelles dont le corps est un ou plusieurs stades de développement. @fr
definition: the class of manual annotations whose body is one or many development stages.
preferred label: Annotation Manuelle des Stades de Développement @fr

Manual Annotation of Diseases
type: Class
subclass of: Automatic of Diseases
subclass of: ManualEntityAnnotation
definition: La classe des annotations manuelles dont le corps est une ou plusieurs maladies. @fr
definition: the class of manual annotations whose body is one or many diseases.
preferred label: Annotation Manuelle des Maladies @fr

Manual Annotation of Harbor Binary Relation
type: Class
subclass of: Annotation of Harbor Binary Relation
subclass of: ManualBinaryRelationAnnotation
definition: La classe des annotations manuelles dont le corps est un triplet RDF avec la propriété bago:harbor ou bago:isFoundOn. La propriété crée un lien entre un organisme hôte et un vecteur. @fr
definition: the class of manual annotations whose body is a RDF triplet with object property bago:harbor or bago:isFoundOn. The property creates a link between a host organism and a vector.
preferred label: Annotation Manuelle de Relation Binaire Accueillir @fr

Manual Annotation of Harmful Organisms
type: Class
subclass of: Annotation of Harmful Organisms
subclass of: ManualEntityAnnotation
definition: La classe des annotations manuelles dont le corps est un ou plusieurs organismes nuisibles. @fr
definition: the class of manual annotations whose body is one or many harmful organism
preferred label: Annotation Manuelle des Organismes Nuisibles @fr

Manual Annotation of Pathogens
type: Class
subclass of: Annotation of Pathogens
subclass of: ManualEntityAnnotation
definition: La classe des annotations manuelles dont le corps est un ou plusieurs pathogènes. @fr
definition: the class of manual annotations whose body is one or many pathogens
preferred label: Annotation Manuelle des Pathogènes @fr

Manual Annotation of Pests
type: Class
subclass of: Annotation of Pests
subclass of: ManualEntityAnnotation
definition: La classe des annotations manuelles dont le corps est un ou plusieurs ravageurs. @fr
definition: the class of manual annotations whose body is one or many pests
preferred label: Annotation Manuelle des Ravageurs @fr

Manual Annotation of Spread Binary Relation
type: Class
subclass of: Annotation of Spread Binary Relation
subclass of: ManualBinaryRelationAnnotation
definition: La classe des annotations manuelles dont le corps est un triplet RDF avec la propriété bago:isSpreadBy ou bago:transmitTheCauseOf. La propriété crée un lien entre une maladie et un vecteur. @fr
definition: the class of manual annotations whose body is a RDF triplet with object property bago:isSpreadBy or bago:transmitTheCauseOf. The property creates a link between a disease and a vector.
preferred label: Annotation Manuelle de Relation Binaire de Dissémination @fr

Manual Annotation of Stage Binary Relation
type: Class
subclass of: ManualBinaryRelationAnnotation
subclass of: SpatialBinaryRelationAnnotation
definition: La classe des annotations manuelles dont le corps est un triplet RDF avec la propriété bago:hasStage. La propriété crée un lien entre un organisme et son stade de développement. @fr
definition: the class of manual annotations whose body is a RDF triplet with object property prov:hasStage. The property links an organism to its development stage.
preferred label: Annotation Manuelle de Relation Binaire Stade @fr

Manual Annotation of Transport Binary Relation
type: Class
subclass of: Annotation of Transport Binary Relation
subclass of: ManualBinaryRelationAnnotation
definition: La classe des annotations manuelles dont le corps est un triplet RDF avec la propriété bago:transport ou bago:isTransportedBy. La propriété crée un lien entre un organisme nuisible et un vecteur. @fr
definition: the class of manual annotations whose body is a RDF triplet with object property bago:transport or bago:isTransportedBy. The property creates a link between an harmfull organism and a vector.
preferred label: Annotation Manuelle de Relation Binaire de Transport @fr

Manual Annotation of Vectors
type: Class
subclass of: Annotation of Vectors
subclass of: ManualEntityAnnotation
definition: La classe des annotations manuelles dont le corps est un ou plusieurs vecteurs de maladie. @fr
definition: the class of manual annotations whose body is one or many vectors
preferred label: Annotation Manuelle des Vecteurs @fr

Annotation of Pathogens
type: Class
equivalent class: Class
  intersection of: EntityAnnotation
  intersection of: Restriction
    on property: has body
    some values from: PathogenMicroOrganism
subclass of: EntityAnnotation
definition: La classe des annotations dont le corps est un ou plusieurs pathogènes. @fr
definition: the class of annotations whose body is one or many pathogens
preferred label: Annotation des Pathogènes @fr

Annotation of Pests
type: Class
equivalent class: Class
  intersection of: EntityAnnotation
  intersection of: Restriction
    on property: has body
    some values from: PestAnimal
subclass of: EntityAnnotation
definition: La classe des annotations dont le corps est un ou plusieurs ravageurs. @fr
definition: the class of annotations whose body is one or many pests
preferred label: Annotation des Ravageurs @fr

Annotation of Spread Binary Relation
type: Class
subclass of: BinaryRelationAnnotation
definition: La classe des annotations dont le corps est un triplet RDF avec la propriété bago:isSpreadBy ou bago:transmitTheCauseOf. La propriété crée un lien entre une maladie et un vecteur. @fr
definition: the class of annotations whose body is a RDF triplet with object property bago:isSpreadBy or bago:transmitTheCauseOf. The property creates a link between a disease and a vector.
preferred label: Annotation de Relation Binaire de Dissémination @fr

Spread Statement
type: Class
subclass of: Statement
definition: la classe des déclarations rdf (rdf:Statement) dont le prédicat est bago:isSpreadBy @fr
definition: the class of rdf:Statement whose rdf:predicate is bago:isSpreadBy
preferred label: Déclaration de Dispersion @fr

Annotation of Stage Binary Relation
type: Class
subclass of: BinaryRelationAnnotation
definition: La classe des annotations dont le corps est un triplet RDF avec la propriété bago:hasStage. La propriété crée un lien entre un organisme et son stade de développement. @fr
definition: the class of annotations whose body is a RDF triplet with object property bago:hasStage. The property links an organism to its development stage.
preferred label: Annotation de Relation Binaire Stade @fr

Annotation of Transport Binary Relation
type: Class
subclass of: BinaryRelationAnnotation
definition: La classe des annotations dont le corps est un triplet RDF avec la propriété bago:transport ou bago:isTransportedBy. La propriété crée un lien entre un organisme nuisible et un vecteur. @fr
definition: the class of annotations whose body is a RDF triplet with object property bago:transport or bago:isTransportedBy. The property creates a link between an harmfull organism and a vector.
preferred label: Annotation de Relation Binaire de Transport @fr

Transport Statement
type: Class
subclass of: Statement
definition: la classe des déclarations rdf (rdf:Statement) dont le prédicat est bago:transport @fr
definition: the class of rdf:Statement whose rdf:predicate is bago:transport
preferred label: Déclaration de Transport @fr

Annotation of Vectors
type: Class
equivalent class: Class
  intersection of: EntityAnnotation
  intersection of: Restriction
    on property: has body
    some values from: BioAggressorVector
subclass of: EntityAnnotation
definition: La classe des annotations dont le corps est un ou plusieurs vecteurs de maladie. @fr
definition: the class of annotations whose body is one or many vectors
preferred label: Annotation des Vecteurs @fr